{"text_format":"1","workbook":"xlsx","n_sheets":2,"sheets":["Sheet1","Sheet2"],"not_rendered":{"charts":0,"images":0,"macros":1,"external_links":0,"defined_names":0,"comments":0,"pivot_tables":0},"unopened":[],"bounds":{"document_bytes":16777216,"sheet_cells":100000,"rows_first":2000,"rows_last":500,"rows_between":2000,"halvings":0,"cell_chars":16384,"cell_head_chars":4096},"cells_cut":0,"cells_raw":0,"read":"whole","date_system":"1900"}

{"sheet":"Sheet1","index":0,"n_rows":125,"n_cols":36,"rows_kept":125,"cut":false,"hidden":false,"merged":[]}
[null,null,null,null,null,null,null,null,null,null,null,null,null,null,null,null,null,null,null,null,null,null,null,null,null,null,1,27,{"$f":"6","v":6},{"$f":"6+AB1-1","v":32},{"$f":"AC1&\":\"&AD1","v":"6:32"},null,"d6:k32"]
[null,null,null,null,null,null,null,null,null,null,null,null,null,null,null,null,null,null,null,null,null,null,null,null,null,null,2,28,{"$f":"6+AB1","v":33},{"$f":"6+AB1+AB2-1","v":60},{"$f":"AC2&\":\"&AD2","v":"33:60"},null,"d33:k60",null,null,{"$f":"ListUP(Sheet2!#REF!,Sheet1!C7:C88,1)","v":{"$error":"#VALUE!"}}]
[null,null,null,null,null,null,null,null,null,null,null,null,null,null,null,null,null,null,null,null,null,null,null,null,null,null,3,27,{"$f":"6+AB1+AB2","v":61},{"$f":"6+AB1+AB2+AB3-1","v":87},"61:87",null,"d61:k87"]
[]
[]
[1,3,1,1,"飯田","絢斗",{"$f":"PHONETIC(E6)","v":"イイダ"},{"$f":"PHONETIC(F6)","v":"ケント"},"男",{"$f":"CONCATENATE(E6,\"　\",F6)","v":"飯田　絢斗"},{"$f":"IFERROR(FIND(\" \",J6,1),16)","v":16},{"$f":"MID(J6,1,K6-1)","v":"飯田　絢斗"},null,{"$f":"ASC(L6)","v":"飯田 絢斗"},{"$f":"ASC(G6)","v":"ｲｲﾀﾞ"},{"$f":"ASC(H6)","v":"ｹﾝﾄ"},{"$f":"CONCATENATE(O6,\" \",P6)","v":"ｲｲﾀﾞ ｹﾝﾄ"},"男"]
[2,3,1,2,"石合","志麻",{"$f":"PHONETIC(E7)","v":"イシアイ"},{"$f":"PHONETIC(F7)","v":"シマ"},"女",{"$f":"CONCATENATE(E7,\"　\",F7)","v":"石合　志麻"},{"$f":"IFERROR(FIND(\" \",J7,1),16)","v":16},{"$f":"MID(J7,1,K7-1)","v":"石合　志麻"},null,{"$f":"ASC(L7)","v":"石合 志麻"},{"$f":"ASC(G7)","v":"ｲｼｱｲ"},{"$f":"ASC(H7)","v":"ｼﾏ"},{"$f":"CONCATENATE(O7,\" \",P7)","v":"ｲｼｱｲ ｼﾏ"},"女"]
[3,3,1,3,"一藤","拓実","イットウ","タクミ","男","一藤　拓実",16,"一藤　拓実",null,"一藤 拓実","ｲｯﾄｳ","ﾀｸﾐ","ｲｯﾄｳ ﾀｸﾐ","男"]
[4,3,1,4,"岩渕","優暖","イワブチ","ユノン","女","岩渕　優暖",16,"岩渕　優暖",null,"岩渕 優暖","ｲﾜﾌﾞﾁ","ﾕﾉﾝ","ｲﾜﾌﾞﾁ ﾕﾉﾝ","女"]
[5,3,1,5,"遠藤","里菜","エンドウ","リナ","女","遠藤　里菜",16,"遠藤　里菜",null,"遠藤 里菜","ｴﾝﾄﾞｳ","ﾘﾅ","ｴﾝﾄﾞｳ ﾘﾅ","女"]
[6,3,1,6,"大浦","玄太郎","オオウラ","ゲンタロウ","男","大浦　玄太郎",16,"大浦　玄太郎",null,"大浦 玄太郎","ｵｵｳﾗ","ｹﾞﾝﾀﾛｳ","ｵｵｳﾗ ｹﾞﾝﾀﾛｳ","男"]
[7,3,1,7,"オオエケ","リオン アファムエフナ","オオエケ","リオン アファムエフナ","男","オオエケ　リオン アファムエフナ",9,"オオエケ　リオン",null,"ｵｵｴｹ ﾘｵﾝ","ｵｵｴｹ","ﾘｵﾝ ｱﾌｧﾑｴﾌﾅ","ｵｵｴｹ ﾘｵﾝ ｱﾌｧﾑｴﾌﾅ","男"]
[8,3,1,8,"菊地","陸斗","キクチ","リクト","男","菊地　陸斗",16,"菊地　陸斗",null,"菊地 陸斗","ｷｸﾁ","ﾘｸﾄ","ｷｸﾁ ﾘｸﾄ","男"]
[9,3,1,9,"久志","紗蘭","クシ","サラン","女","久志　紗蘭",16,"久志　紗蘭",null,"久志 紗蘭","ｸｼ","ｻﾗﾝ","ｸｼ ｻﾗﾝ","女"]
[10,3,1,10,"桑本","祥","クワモト","ショウ","男","桑本　祥",16,"桑本　祥",null,"桑本 祥","ｸﾜﾓﾄ","ｼｮｳ","ｸﾜﾓﾄ ｼｮｳ","男"]
[11,3,1,11,"佐久間","翔大","サクマ","ショウタ","男","佐久間　翔大",16,"佐久間　翔大",null,"佐久間 翔大","ｻｸﾏ","ｼｮｳﾀ","ｻｸﾏ ｼｮｳﾀ","男"]
[12,3,1,12,"佐藤","寛人","サトウ","ヒロト","男","佐藤　寛人",16,"佐藤　寛人",null,"佐藤 寛人","ｻﾄｳ","ﾋﾛﾄ","ｻﾄｳ ﾋﾛﾄ","男"]
[13,3,1,13,"渋谷","芽結","シブヤ","メイ","女","渋谷　芽結",16,"渋谷　芽結",null,"渋谷 芽結","ｼﾌﾞﾔ","ﾒｲ","ｼﾌﾞﾔ ﾒｲ","女"]
[14,3,1,14,"スカーレット","里那","スカーレット","リタ","女","スカーレット　里那",16,"スカーレット　里那",null,"ｽｶｰﾚｯﾄ 里那","ｽｶｰﾚｯﾄ","ﾘﾀ","ｽｶｰﾚｯﾄ ﾘﾀ","女"]
[15,3,1,15,"菅原","優奈","スガワラ","ユウナ","女","菅原　優奈",16,"菅原　優奈",null,"菅原 優奈","ｽｶﾞﾜﾗ","ﾕｳﾅ","ｽｶﾞﾜﾗ ﾕｳﾅ","女"]
[16,3,1,16,"千代","一馬","チヨ","カズマ","男","千代　一馬",16,"千代　一馬",null,"千代 一馬","ﾁﾖ","ｶｽﾞﾏ","ﾁﾖ ｶｽﾞﾏ","男"]
[17,3,1,17,"成田","旺介","ナリタ","オウスケ","男","成田　旺介",16,"成田　旺介",null,"成田 旺介","ﾅﾘﾀ","ｵｳｽｹ","ﾅﾘﾀ ｵｳｽｹ","男"]
[18,3,1,18,"成島","朱音","ナルシマ","アカネ","女","成島　朱音",16,"成島　朱音",null,"成島 朱音","ﾅﾙｼﾏ","ｱｶﾈ","ﾅﾙｼﾏ ｱｶﾈ","女"]
[19,3,1,19,"平松","咲稀","ヒラマツ","サキ","女","平松　咲稀",16,"平松　咲稀",null,"平松 咲稀","ﾋﾗﾏﾂ","ｻｷ","ﾋﾗﾏﾂ ｻｷ","女"]
[20,3,1,20,"藤巻","志","フジマキ","ココロ","男","藤巻　志",16,"藤巻　志",null,"藤巻 志","ﾌｼﾞﾏｷ","ｺｺﾛ","ﾌｼﾞﾏｷ ｺｺﾛ","男"]
[21,3,1,21,"前田","航","マエダ","ワタル","男","前田　航",16,"前田　航",null,"前田 航","ﾏｴﾀﾞ","ﾜﾀﾙ","ﾏｴﾀﾞ ﾜﾀﾙ","男"]
[22,3,1,22,"松本","凛桜","マツモト","リオ","女","松本　凛桜",16,"松本　凛桜",null,"松本 凛桜","ﾏﾂﾓﾄ","ﾘｵ","ﾏﾂﾓﾄ ﾘｵ","女"]
[23,3,1,23,"丸山","佳華","マルヤマ","ヨシカ","女","丸山　佳華",16,"丸山　佳華",null,"丸山 佳華","ﾏﾙﾔﾏ","ﾖｼｶ","ﾏﾙﾔﾏ ﾖｼｶ","女"]
[24,3,1,24,"餅","瑛心","モチ","エイシン","男","餅　瑛心",16,"餅　瑛心",null,"餅 瑛心","ﾓﾁ","ｴｲｼﾝ","ﾓﾁ ｴｲｼﾝ","男"]
[25,3,1,25,"八倉","慶伍","ヤクラ","ケイゴ","男","八倉　慶伍",16,"八倉　慶伍",null,"八倉 慶伍","ﾔｸﾗ","ｹｲｺﾞ","ﾔｸﾗ ｹｲｺﾞ","男"]
[26,3,1,26,"結城","征音","ユウキ","セオン","男","結城　征音",16,"結城　征音",null,"結城 征音","ﾕｳｷ","ｾｵﾝ","ﾕｳｷ ｾｵﾝ","男"]
[27,3,1,27,"渡邉","友翔","ワタナベ","ユウガ","男","渡邉　友翔",16,"渡邉　友翔",null,"渡邉 友翔","ﾜﾀﾅﾍﾞ","ﾕｳｶﾞ","ﾜﾀﾅﾍﾞ ﾕｳｶﾞ","男"]
[28,3,2,1,"相原","柚花","アイハラ","ユズカ","女","相原　柚花",16,"相原　柚花",null,"相原 柚花","ｱｲﾊﾗ","ﾕｽﾞｶ","ｱｲﾊﾗ ﾕｽﾞｶ","女"]
[29,3,2,2,"青木","和","アオキ","ナゴミ","女","青木　和",16,"青木　和",null,"青木 和","ｱｵｷ","ﾅｺﾞﾐ","ｱｵｷ ﾅｺﾞﾐ","女"]
[30,3,2,3,"青木","乃々","アオキ","ノノ","女","青木　乃々",16,"青木　乃々",null,"青木 乃々","ｱｵｷ","ﾉﾉ","ｱｵｷ ﾉﾉ","女"]
[31,3,2,4,"石井","乃愛","イシイ","ノア","女","石井　乃愛",16,"石井　乃愛",null,"石井 乃愛","ｲｼｲ","ﾉｱ","ｲｼｲ ﾉｱ","女"]
[32,3,2,5,"市村","光希","イチムラ","コウキ","男","市村　光希",16,"市村　光希",null,"市村 光希","ｲﾁﾑﾗ","ｺｳｷ","ｲﾁﾑﾗ ｺｳｷ","男"]
[33,3,2,6,"入江","駿","イリエ","シュン","男","入江　駿",16,"入江　駿",null,"入江 駿","ｲﾘｴ","ｼｭﾝ","ｲﾘｴ ｼｭﾝ","男"]
[34,3,2,7,"浦本","蒼史朗","ウラモト","ソウシロウ","男","浦本　蒼史朗",16,"浦本　蒼史朗",null,"浦本 蒼史朗","ｳﾗﾓﾄ","ｿｳｼﾛｳ","ｳﾗﾓﾄ ｿｳｼﾛｳ","男"]
[35,3,2,8,"大江","由太","オオエ","ユウタ","男","大江　由太",16,"大江　由太",null,"大江 由太","ｵｵｴ","ﾕｳﾀ","ｵｵｴ ﾕｳﾀ","男"]
[36,3,2,9,"太田","恵仲","オオタ","エナ","男","太田　恵仲",16,"太田　恵仲",null,"太田 恵仲","ｵｵﾀ","ｴﾅ","ｵｵﾀ ｴﾅ","男"]
[37,3,2,10,"鹿居","祐里","カオル","ユウリ","女","鹿居　祐里",16,"鹿居　祐里",null,"鹿居 祐里","ｶｵﾙ","ﾕｳﾘ","ｶｵﾙ ﾕｳﾘ","女"]
[38,3,2,11,"金子","豪太郎","カネコ","ゴウタロウ","男","金子　豪太郎",16,"金子　豪太郎",null,"金子 豪太郎","ｶﾈｺ","ｺﾞｳﾀﾛｳ","ｶﾈｺ ｺﾞｳﾀﾛｳ","男"]
[39,3,2,12,"川﨑","美羽","カワサキ","ミオ","女","川﨑　美羽",16,"川﨑　美羽",null,"川﨑 美羽","ｶﾜｻｷ","ﾐｵ","ｶﾜｻｷ ﾐｵ","女"]
[40,3,2,13,"亀卦川","大樹","キケガワ","ダイキ","男","亀卦川　大樹",16,"亀卦川　大樹",null,"亀卦川 大樹","ｷｹｶﾞﾜ","ﾀﾞｲｷ","ｷｹｶﾞﾜ ﾀﾞｲｷ","男"]
[41,3,2,14,"國井","藍人","クニイ","アイト","男","國井　藍人",16,"國井　藍人",null,"國井 藍人","ｸﾆｲ","ｱｲﾄ","ｸﾆｲ ｱｲﾄ","男"]
[42,3,2,15,"坂本","煌羽","サカモト","コウ","男","坂本　煌羽",16,"坂本　煌羽",null,"坂本 煌羽","ｻｶﾓﾄ","ｺｳ","ｻｶﾓﾄ ｺｳ","男"]
[43,3,2,16,"迫間","桜一朗","サコマ","オウイチロウ","男","迫間　桜一朗",16,"迫間　桜一朗",null,"迫間 桜一朗","ｻｺﾏ","ｵｳｲﾁﾛｳ","ｻｺﾏ ｵｳｲﾁﾛｳ","男"]
[44,3,2,17,"滝沢","直太郎","タキザワ","ナオタロウ","男","滝沢　直太郎",16,"滝沢　直太郎",null,"滝沢 直太郎","ﾀｷｻﾞﾜ","ﾅｵﾀﾛｳ","ﾀｷｻﾞﾜ ﾅｵﾀﾛｳ","男"]
[45,3,2,18,"田中","廉誠","タナカ","レンセイ","男","田中　廉誠",16,"田中　廉誠",null,"田中 廉誠","ﾀﾅｶ","ﾚﾝｾｲ","ﾀﾅｶ ﾚﾝｾｲ","男"]
[46,3,2,19,"土手","創平","ドテ","ソウヘイ","男","土手　創平",16,"土手　創平",null,"土手 創平","ﾄﾞﾃ","ｿｳﾍｲ","ﾄﾞﾃ ｿｳﾍｲ","男"]
[47,3,2,20,"外崎","心路","トノサキ","ココロ","女","外崎　心路",16,"外崎　心路",null,"外崎 心路","ﾄﾉｻｷ","ｺｺﾛ","ﾄﾉｻｷ ｺｺﾛ","女"]
[48,3,2,21,"長野","龍音","ナガノ","リュウト","男","長野　龍音",16,"長野　龍音",null,"長野 龍音","ﾅｶﾞﾉ","ﾘｭｳﾄ","ﾅｶﾞﾉ ﾘｭｳﾄ","男"]
[49,3,2,22,"中村","桂奈","ナカムラ","ケイナ","女","中村　桂奈",16,"中村　桂奈",null,"中村 桂奈","ﾅｶﾑﾗ","ｹｲﾅ","ﾅｶﾑﾗ ｹｲﾅ","女"]
[50,3,2,23,"橋本","果歩","ハシモト","カホ","女","橋本　果歩",16,"橋本　果歩",null,"橋本 果歩","ﾊｼﾓﾄ","ｶﾎ","ﾊｼﾓﾄ ｶﾎ","女"]
[51,3,2,24,"廣瀧","正宗","ヒロタキ","マサムネ","男","廣瀧　正宗",16,"廣瀧　正宗",null,"廣瀧 正宗","ﾋﾛﾀｷ","ﾏｻﾑﾈ","ﾋﾛﾀｷ ﾏｻﾑﾈ","男"]
[52,3,2,25,"藤本","葉菜","フジモト","ハナ","女","藤本　葉菜",16,"藤本　葉菜",null,"藤本 葉菜","ﾌｼﾞﾓﾄ","ﾊﾅ","ﾌｼﾞﾓﾄ ﾊﾅ","女"]
[53,3,2,26,"松井","涼太朗","マツイ","リョウタロウ","男","松井　涼太朗",16,"松井　涼太朗",null,"松井 涼太朗","ﾏﾂｲ","ﾘｮｳﾀﾛｳ","ﾏﾂｲ ﾘｮｳﾀﾛｳ","男"]
[54,3,2,27,"三浦","晴","ミウラ","ハル","女","三浦　晴",16,"三浦　晴",null,"三浦 晴","ﾐｳﾗ","ﾊﾙ","ﾐｳﾗ ﾊﾙ","女"]
[55,3,2,28,"諸墨","凛太朗","モロズミ","リンタロウ","男","諸墨　凛太朗",16,"諸墨　凛太朗",null,"諸墨 凛太朗","ﾓﾛｽﾞﾐ","ﾘﾝﾀﾛｳ","ﾓﾛｽﾞﾐ ﾘﾝﾀﾛｳ","男"]
[56,3,3,1,"石井","颯汰","イシイ","ソウタ","男","石井　颯汰",16,"石井　颯汰",null,"石井 颯汰","ｲｼｲ","ｿｳﾀ","ｲｼｲ ｿｳﾀ","男"]
[57,3,3,2,"海野","聖乃","ウミノ","キヨノ","女","海野　聖乃",16,"海野　聖乃",null,"海野 聖乃","ｳﾐﾉ","ｷﾖﾉ","ｳﾐﾉ ｷﾖﾉ","女"]
[58,3,3,3,"榎本","珀","エノモト","ハク","男","榎本　珀",16,"榎本　珀",null,"榎本 珀","ｴﾉﾓﾄ","ﾊｸ","ｴﾉﾓﾄ ﾊｸ","男"]
[59,3,3,4,"大内","瑠夏","オオウチ","ルナ","女","大内　瑠夏",16,"大内　瑠夏",null,"大内 瑠夏","ｵｵｳﾁ","ﾙﾅ","ｵｵｳﾁ ﾙﾅ","女"]
[60,3,3,5,"オオサワ","廉音","オオサワ","レオン","男","オオサワ　廉音",16,"オオサワ　廉音",null,"ｵｵｻﾜ 廉音","ｵｵｻﾜ","ﾚｵﾝ","ｵｵｻﾜ ﾚｵﾝ","男"]
[61,3,3,6,"カシャニ","セパンタ","カシャニ","セパンタ","男","カシャニ　セパンタ",16,"カシャニ　セパンタ",null,"ｶｼｬﾆ ｾﾊﾟﾝﾀ","ｶｼｬﾆ","ｾﾊﾟﾝﾀ","ｶｼｬﾆ ｾﾊﾟﾝﾀ","男"]
[62,3,3,7,"栗生","響喜","クリウ","ヒビキ","男","栗生　響喜",16,"栗生　響喜",null,"栗生 響喜","ｸﾘｳ","ﾋﾋﾞｷ","ｸﾘｳ ﾋﾋﾞｷ","男"]
[63,3,3,8,"黒田","隆之介","クロダ","リュウノスケ","男","黒田　隆之介",16,"黒田　隆之介",null,"黒田 隆之介","ｸﾛﾀﾞ","ﾘｭｳﾉｽｹ","ｸﾛﾀﾞ ﾘｭｳﾉｽｹ","男"]
[64,3,3,9,"榊","美好","サカキ","ミヨシ","女","榊　美好",16,"榊　美好",null,"榊 美好","ｻｶｷ","ﾐﾖｼ","ｻｶｷ ﾐﾖｼ","女"]
[65,3,3,10,"佐藤","漣","サトウ","レン","男","佐藤　漣",16,"佐藤　漣",null,"佐藤 漣","ｻﾄｳ","ﾚﾝ","ｻﾄｳ ﾚﾝ","男"]
[66,3,3,11,"篠﨑","朔太郎","シノザキ","サクタロウ","男",{"$f":"CONCATENATE(E71,\"　\",F71)","v":"篠﨑　朔太郎"},{"$f":"IFERROR(FIND(\" \",J71,1),16)","v":16},{"$f":"MID(J71,1,K71-1)","v":"篠﨑　朔太郎"},null,{"$f":"ASC(L71)","v":"篠﨑 朔太郎"},{"$f":"ASC(G71)","v":"ｼﾉｻﾞｷ"},{"$f":"ASC(H71)","v":"ｻｸﾀﾛｳ"},{"$f":"CONCATENATE(O71,\" \",P71)","v":"ｼﾉｻﾞｷ ｻｸﾀﾛｳ"},"男"]
[67,3,3,12,"田野","蒼汰郎","タノ","ソウタロウ","男","田野　蒼汰郎",16,"田野　蒼汰郎",null,"田野 蒼汰郎","ﾀﾉ","ｿｳﾀﾛｳ","ﾀﾉ ｿｳﾀﾛｳ","男"]
[68,3,3,13,"永井","将真","ナガイ","ショウマ","男","永井　将真",16,"永井　将真",null,"永井 将真","ﾅｶﾞｲ","ｼｮｳﾏ","ﾅｶﾞｲ ｼｮｳﾏ","男"]
[69,3,3,14,"仲道","心哉","ナカミチ","シンヤ","男","仲道　心哉",16,"仲道　心哉",null,"仲道 心哉","ﾅｶﾐﾁ","ｼﾝﾔ","ﾅｶﾐﾁ ｼﾝﾔ","男"]
[70,3,3,15,"西下","優海帆","ニシシタ","ユミホ","女","西下　優海帆",16,"西下　優海帆",null,"西下 優海帆","ﾆｼｼﾀ","ﾕﾐﾎ","ﾆｼｼﾀ ﾕﾐﾎ","女"]
[71,3,3,16,"畠山","雄真","ハタケヤマ","ユウマ","男","畠山　雄真",16,"畠山　雄真",null,"畠山 雄真","ﾊﾀｹﾔﾏ","ﾕｳﾏ","ﾊﾀｹﾔﾏ ﾕｳﾏ","男"]
[72,3,3,17,"原田","紗也","ハラダ","サヤ","女","原田　紗也",16,"原田　紗也",null,"原田 紗也","ﾊﾗﾀﾞ","ｻﾔ","ﾊﾗﾀﾞ ｻﾔ","女"]
[73,3,3,18,"ハルバレスキ","バレンティーナ","ハルバレスキ","バレンティーナ","女","ハルバレスキ　バレンティーナ",16,"ハルバレスキ　バレンティーナ",null,"ﾊﾙﾊﾞﾚｽｷ ﾊﾞﾚﾝﾃｨｰﾅ","ﾊﾙﾊﾞﾚｽｷ","ﾊﾞﾚﾝﾃｨｰﾅ","ﾊﾙﾊﾞﾚｽｷ ﾊﾞﾚﾝﾃｨｰﾅ","女"]
[74,3,3,19,"広岡","佑丞","ヒロオカ","ユウスケ","男","広岡　佑丞",16,"広岡　佑丞",null,"広岡 佑丞","ﾋﾛｵｶ","ﾕｳｽｹ","ﾋﾛｵｶ ﾕｳｽｹ","男"]
[75,3,3,20,"福嶋","美乃莉","フクシマ","ミノリ","女","福嶋　美乃莉",16,"福嶋　美乃莉",null,"福嶋 美乃莉","ﾌｸｼﾏ","ﾐﾉﾘ","ﾌｸｼﾏ ﾐﾉﾘ","女"]
[76,3,3,21,"二ツ木","杏","フタツギ","アンズ","女","二ツ木　杏",16,"二ツ木　杏",null,"二ﾂ木 杏","ﾌﾀﾂｷﾞ","ｱﾝｽﾞ","ﾌﾀﾂｷﾞ ｱﾝｽﾞ","女"]
[77,3,3,22,"松田","彩希","マツダ","サキ","女","松田　彩希",16,"松田　彩希",null,"松田 彩希","ﾏﾂﾀﾞ","ｻｷ","ﾏﾂﾀﾞ ｻｷ","女"]
[78,3,3,23,"谷田部","侑也","ヤタベ","ユウヤ","男","谷田部　侑也",16,"谷田部　侑也",null,"谷田部 侑也","ﾔﾀﾍﾞ","ﾕｳﾔ","ﾔﾀﾍﾞ ﾕｳﾔ","男"]
[79,3,3,24,"山川","愛雅","ヤマカワ","アイミ","女","山川　愛雅",16,"山川　愛雅",null,"山川 愛雅","ﾔﾏｶﾜ","ｱｲﾐ","ﾔﾏｶﾜ ｱｲﾐ","女"]
[80,3,3,25,"山﨑","篤人","ヤマザキ","アツト","男","山﨑　篤人",16,"山﨑　篤人",null,"山﨑 篤人","ﾔﾏｻﾞｷ","ｱﾂﾄ","ﾔﾏｻﾞｷ ｱﾂﾄ","男"]
[81,3,3,26,"吉澤","玲","ヨシザワ","レイ","男","吉澤　玲",16,"吉澤　玲",null,"吉澤 玲","ﾖｼｻﾞﾜ","ﾚｲ","ﾖｼｻﾞﾜ ﾚｲ","男"]
[82,3,3,27,"ルエラン","サマンサ ユリカブレラ","ルエラン","サマンサ ユリカブレラ","女","ルエラン　サマンサ ユリカブレラ",10,"ルエラン　サマンサ",null,"ﾙｴﾗﾝ ｻﾏﾝｻ","ﾙｴﾗﾝ","ｻﾏﾝｻ ﾕﾘｶﾌﾞﾚﾗ","ﾙｴﾗﾝ ｻﾏﾝｻ ﾕﾘｶﾌﾞﾚﾗ","女"]
[83]
[84]
[85]
[86]
[87]
[88]
[89]
[90]
[91]
[92]
[93]
[94]
[95]
[96]
[97]
[98]
[99]
[100]
[101]
[102]
[103]
[104]
[105]
[106]
[107]
[108]
[109]
[110]
[111]
[112]
[113]
[114]
[115]
[116]
[117]
[118]
[119]
[120]

{"sheet":"Sheet2","index":1,"n_rows":37,"n_cols":21,"rows_kept":37,"cut":false,"hidden":false,"merged":[[1,2,1,3]]}
[1,"d6:z32",null,null,null,null,null,null,null,null,null,null,null,null,null,null,null,null,null,1,"影山 泰明"]
[2,"d33:z60","３年名簿",null,null,null,null,null,null,null,null,null,null,null,null,null,null,null,null,2,"中 優菜美"]
[3,"d61:z87",3,"組",null,null,null,null,null,null,null,null,null,null,null,null,null,null,null,3,"服部 貴洋"]
[null,null,"担任",{"$f":"VLOOKUP(C3,T1:U3,2)","v":"服部 貴洋"}]
[]
[null,1,{"$f":"IF(VLOOKUP(B6,INDIRECT(\"sheet1!\"&VLOOKUP($C$3,$A$1:$B$3,2)),1)<B6,\"\",VLOOKUP(B6,INDIRECT(\"sheet1!\"&VLOOKUP($C$3,$A$1:$B$3,2)),1))","v":1},{"$f":"IFERROR(ASC(VLOOKUP(C6,INDIRECT(\"sheet1!\"&VLOOKUP($C$3,$A$1:$B$3,2)),9)),\"\")","v":"石井 颯汰"},{"$f":"IFERROR(VLOOKUP(D6,Sheet1!$N$6:$R$87,5,0),\"\")","v":"男"},null,null,null,null,null,null,null,null,null,null,null,null,{"$f":"IFERROR(VLOOKUP(D6,Sheet1!$N$6:$Q$87,4,0),\"\")","v":"ｲｼｲ ｿｳﾀ"}]
[null,2,2,"海野 聖乃",{"$f":"IFERROR(VLOOKUP(D7,Sheet1!$N$6:$R$87,5,0),\"\")","v":"女"},null,null,null,null,null,null,null,null,null,null,null,null,{"$f":"IFERROR(VLOOKUP(D7,Sheet1!$N$6:$Q$87,4,0),\"\")","v":"ｳﾐﾉ ｷﾖﾉ"}]
[null,3,3,"榎本 珀",{"$f":"IFERROR(VLOOKUP(D8,Sheet1!$N$6:$R$87,5,0),\"\")","v":"男"},null,null,null,null,null,null,null,null,null,null,null,null,{"$f":"IFERROR(VLOOKUP(D8,Sheet1!$N$6:$Q$87,4,0),\"\")","v":"ｴﾉﾓﾄ ﾊｸ"}]
[null,4,4,"大内 瑠夏",{"$f":"IFERROR(VLOOKUP(D9,Sheet1!$N$6:$R$87,5,0),\"\")","v":"女"},null,null,null,null,null,null,null,null,null,null,null,null,{"$f":"IFERROR(VLOOKUP(D9,Sheet1!$N$6:$Q$87,4,0),\"\")","v":"ｵｵｳﾁ ﾙﾅ"}]
[null,5,5,"ｵｵｻﾜ 廉音",{"$f":"IFERROR(VLOOKUP(D10,Sheet1!$N$6:$R$87,5,0),\"\")","v":"男"},null,null,null,null,null,null,null,null,null,null,null,null,{"$f":"IFERROR(VLOOKUP(D10,Sheet1!$N$6:$Q$87,4,0),\"\")","v":"ｵｵｻﾜ ﾚｵﾝ"}]
[null,6,6,"ｶｼｬﾆ ｾﾊﾟﾝﾀ",{"$f":"IFERROR(VLOOKUP(D11,Sheet1!$N$6:$R$87,5,0),\"\")","v":"男"},null,null,null,null,null,null,null,null,null,null,null,null,{"$f":"IFERROR(VLOOKUP(D11,Sheet1!$N$6:$Q$87,4,0),\"\")","v":"ｶｼｬﾆ ｾﾊﾟﾝﾀ"}]
[null,7,7,"栗生 響喜",{"$f":"IFERROR(VLOOKUP(D12,Sheet1!$N$6:$R$87,5,0),\"\")","v":"男"},null,null,null,null,null,null,null,null,null,null,null,null,{"$f":"IFERROR(VLOOKUP(D12,Sheet1!$N$6:$Q$87,4,0),\"\")","v":"ｸﾘｳ ﾋﾋﾞｷ"}]
[null,8,8,"黒田 隆之介",{"$f":"IFERROR(VLOOKUP(D13,Sheet1!$N$6:$R$87,5,0),\"\")","v":"男"},null,null,null,null,null,null,null,null,null,null,null,null,{"$f":"IFERROR(VLOOKUP(D13,Sheet1!$N$6:$Q$87,4,0),\"\")","v":"ｸﾛﾀﾞ ﾘｭｳﾉｽｹ"}]
[null,9,9,"榊 美好",{"$f":"IFERROR(VLOOKUP(D14,Sheet1!$N$6:$R$87,5,0),\"\")","v":"女"},null,null,null,null,null,null,null,null,null,null,null,null,{"$f":"IFERROR(VLOOKUP(D14,Sheet1!$N$6:$Q$87,4,0),\"\")","v":"ｻｶｷ ﾐﾖｼ"}]
[null,10,10,"佐藤 漣",{"$f":"IFERROR(VLOOKUP(D15,Sheet1!$N$6:$R$87,5,0),\"\")","v":"男"},null,null,null,null,null,null,null,null,null,null,null,null,{"$f":"IFERROR(VLOOKUP(D15,Sheet1!$N$6:$Q$87,4,0),\"\")","v":"ｻﾄｳ ﾚﾝ"}]
[null,11,11,"篠﨑 朔太郎",{"$f":"IFERROR(VLOOKUP(D16,Sheet1!$N$6:$R$87,5,0),\"\")","v":"男"},null,null,null,null,null,null,null,null,null,null,null,null,{"$f":"IFERROR(VLOOKUP(D16,Sheet1!$N$6:$Q$87,4,0),\"\")","v":"ｼﾉｻﾞｷ ｻｸﾀﾛｳ"}]
[null,12,12,"田野 蒼汰郎",{"$f":"IFERROR(VLOOKUP(D17,Sheet1!$N$6:$R$87,5,0),\"\")","v":"男"},null,null,null,null,null,null,null,null,null,null,null,null,{"$f":"IFERROR(VLOOKUP(D17,Sheet1!$N$6:$Q$87,4,0),\"\")","v":"ﾀﾉ ｿｳﾀﾛｳ"}]
[null,13,13,"永井 将真",{"$f":"IFERROR(VLOOKUP(D18,Sheet1!$N$6:$R$87,5,0),\"\")","v":"男"},null,null,null,null,null,null,null,null,null,null,null,null,{"$f":"IFERROR(VLOOKUP(D18,Sheet1!$N$6:$Q$87,4,0),\"\")","v":"ﾅｶﾞｲ ｼｮｳﾏ"}]
[null,14,14,"仲道 心哉",{"$f":"IFERROR(VLOOKUP(D19,Sheet1!$N$6:$R$87,5,0),\"\")","v":"男"},null,null,null,null,null,null,null,null,null,null,null,null,{"$f":"IFERROR(VLOOKUP(D19,Sheet1!$N$6:$Q$87,4,0),\"\")","v":"ﾅｶﾐﾁ ｼﾝﾔ"}]
[null,15,15,"西下 優海帆",{"$f":"IFERROR(VLOOKUP(D20,Sheet1!$N$6:$R$87,5,0),\"\")","v":"女"},null,null,null,null,null,null,null,null,null,null,null,null,{"$f":"IFERROR(VLOOKUP(D20,Sheet1!$N$6:$Q$87,4,0),\"\")","v":"ﾆｼｼﾀ ﾕﾐﾎ"}]
[null,16,16,"畠山 雄真",{"$f":"IFERROR(VLOOKUP(D21,Sheet1!$N$6:$R$87,5,0),\"\")","v":"男"},null,null,null,null,null,null,null,null,null,null,null,null,{"$f":"IFERROR(VLOOKUP(D21,Sheet1!$N$6:$Q$87,4,0),\"\")","v":"ﾊﾀｹﾔﾏ ﾕｳﾏ"}]
[null,17,17,"原田 紗也",{"$f":"IFERROR(VLOOKUP(D22,Sheet1!$N$6:$R$87,5,0),\"\")","v":"女"},null,null,null,null,null,null,null,null,null,null,null,null,{"$f":"IFERROR(VLOOKUP(D22,Sheet1!$N$6:$Q$87,4,0),\"\")","v":"ﾊﾗﾀﾞ ｻﾔ"}]
[null,18,18,"ﾊﾙﾊﾞﾚｽｷ ﾊﾞﾚﾝﾃｨｰﾅ",{"$f":"IFERROR(VLOOKUP(D23,Sheet1!$N$6:$R$87,5,0),\"\")","v":"女"},null,null,null,null,null,null,null,null,null,null,null,null,{"$f":"IFERROR(VLOOKUP(D23,Sheet1!$N$6:$Q$87,4,0),\"\")","v":"ﾊﾙﾊﾞﾚｽｷ ﾊﾞﾚﾝﾃｨｰﾅ"}]
[null,19,19,"広岡 佑丞",{"$f":"IFERROR(VLOOKUP(D24,Sheet1!$N$6:$R$87,5,0),\"\")","v":"男"},null,null,null,null,null,null,null,null,null,null,null,null,{"$f":"IFERROR(VLOOKUP(D24,Sheet1!$N$6:$Q$87,4,0),\"\")","v":"ﾋﾛｵｶ ﾕｳｽｹ"}]
[null,20,20,"福嶋 美乃莉",{"$f":"IFERROR(VLOOKUP(D25,Sheet1!$N$6:$R$87,5,0),\"\")","v":"女"},null,null,null,null,null,null,null,null,null,null,null,null,{"$f":"IFERROR(VLOOKUP(D25,Sheet1!$N$6:$Q$87,4,0),\"\")","v":"ﾌｸｼﾏ ﾐﾉﾘ"}]
[null,21,21,"二ﾂ木 杏",{"$f":"IFERROR(VLOOKUP(D26,Sheet1!$N$6:$R$87,5,0),\"\")","v":"女"},null,null,null,null,null,null,null,null,null,null,null,null,{"$f":"IFERROR(VLOOKUP(D26,Sheet1!$N$6:$Q$87,4,0),\"\")","v":"ﾌﾀﾂｷﾞ ｱﾝｽﾞ"}]
[null,22,22,"松田 彩希",{"$f":"IFERROR(VLOOKUP(D27,Sheet1!$N$6:$R$87,5,0),\"\")","v":"女"},null,null,null,null,null,null,null,null,null,null,null,null,{"$f":"IFERROR(VLOOKUP(D27,Sheet1!$N$6:$Q$87,4,0),\"\")","v":"ﾏﾂﾀﾞ ｻｷ"}]
[null,23,23,"谷田部 侑也",{"$f":"IFERROR(VLOOKUP(D28,Sheet1!$N$6:$R$87,5,0),\"\")","v":"男"},null,null,null,null,null,null,null,null,null,null,null,null,{"$f":"IFERROR(VLOOKUP(D28,Sheet1!$N$6:$Q$87,4,0),\"\")","v":"ﾔﾀﾍﾞ ﾕｳﾔ"}]
[null,24,24,"山川 愛雅",{"$f":"IFERROR(VLOOKUP(D29,Sheet1!$N$6:$R$87,5,0),\"\")","v":"女"},null,null,null,null,null,null,null,null,null,null,null,null,{"$f":"IFERROR(VLOOKUP(D29,Sheet1!$N$6:$Q$87,4,0),\"\")","v":"ﾔﾏｶﾜ ｱｲﾐ"}]
[null,25,25,"山﨑 篤人",{"$f":"IFERROR(VLOOKUP(D30,Sheet1!$N$6:$R$87,5,0),\"\")","v":"男"},null,null,null,null,null,null,null,null,null,null,null,null,{"$f":"IFERROR(VLOOKUP(D30,Sheet1!$N$6:$Q$87,4,0),\"\")","v":"ﾔﾏｻﾞｷ ｱﾂﾄ"}]
[null,26,26,"吉澤 玲",{"$f":"IFERROR(VLOOKUP(D31,Sheet1!$N$6:$R$87,5,0),\"\")","v":"男"},null,null,null,null,null,null,null,null,null,null,null,null,{"$f":"IFERROR(VLOOKUP(D31,Sheet1!$N$6:$Q$87,4,0),\"\")","v":"ﾖｼｻﾞﾜ ﾚｲ"}]
[null,27,27,"ﾙｴﾗﾝ ｻﾏﾝｻ",{"$f":"IFERROR(VLOOKUP(D32,Sheet1!$N$6:$R$87,5,0),\"\")","v":"女"},null,null,null,null,null,null,null,null,null,null,null,null,{"$f":"IFERROR(VLOOKUP(D32,Sheet1!$N$6:$Q$87,4,0),\"\")","v":"ﾙｴﾗﾝ ｻﾏﾝｻ ﾕﾘｶﾌﾞﾚﾗ"}]
[null,28,"","",{"$f":"IFERROR(VLOOKUP(D33,Sheet1!$N$6:$R$87,5,0),\"\")","v":""},null,null,null,null,null,null,null,null,null,null,null,null,{"$f":"IFERROR(VLOOKUP(D33,Sheet1!$N$6:$Q$87,4,0),\"\")","v":""}]
[null,29,"","",{"$f":"IFERROR(VLOOKUP(D34,Sheet1!$N$6:$R$87,5,0),\"\")","v":""},null,null,null,null,null,null,null,null,null,null,null,null,{"$f":"IFERROR(VLOOKUP(D34,Sheet1!$N$6:$Q$87,4,0),\"\")","v":""}]
[null,30,"","",{"$f":"IFERROR(VLOOKUP(D35,Sheet1!$N$6:$R$87,5,0),\"\")","v":""},null,null,null,null,null,null,null,null,null,null,null,null,{"$f":"IFERROR(VLOOKUP(D35,Sheet1!$N$6:$Q$87,4,0),\"\")","v":""}]
[null,null,null,"",{"$f":"IFERROR(VLOOKUP(D36,Sheet1!$N$6:$R$87,5,0),\"\")","v":""},null,null,null,null,null,null,null,null,null,null,null,null,{"$f":"IFERROR(VLOOKUP(D36,Sheet1!$N$6:$Q$87,4,0),\"\")","v":""}]
[null,null,null,"",{"$f":"IFERROR(VLOOKUP(D37,Sheet1!$N$6:$R$87,5,0),\"\")","v":""},null,null,null,null,null,null,null,null,null,null,null,null,{"$f":"IFERROR(VLOOKUP(D37,Sheet1!$N$6:$Q$87,4,0),\"\")","v":""}]